Build error

Mitchell Henderson mitchell at
Mon Aug 11 13:09:15 EDT 2003

	I'm trying to build kerberos 1.3.1 on a Ultra10 running solaris9 fully patched.  I'm building useing gcc-3.3 and bison 1.875.  The error is..

make[2]: Entering directory `/export/tmp/krb5-1.3.1/src/kadmin/cli'
bison -y  getdate.y 
conflicts: 4 shift/reduce
make[2]: *** [getdate.c] Broken Pipe
make[2]: Leaving directory `/export/tmp/krb5-1.3.1/src/kadmin/cli'
make[1]: *** [all-recurse] Error 1
make[1]: Leaving directory `/export/tmp/krb5-1.3.1/src/kadmin'
make: *** [all-recurse] Error 1

Is this a bug or am I doing something wrong?  
Mitchell Henderson
mitchell at

More information about the Kerberos mailing list